Target
Protein kinase C alpha type
Ligand
BDBM3032
Substrate
Protamine Sulfate
Meas. Tech.
Kinase Inhibition Assay
IC50
>100000±n/a nM
Citation
 Traxler, PBold, GFrei, JLang, MLydon, NMett, HBuchdunger, EMeyer, TMueller, MFuret, P Use of a pharmacophore model for the design of EGF-R tyrosine kinase inhibitors: 4-(phenylamino)pyrazolo[3,4-d]pyrimidines. J Med Chem 40:3601-16 (1997)  
Target
Name:
Protein kinase C alpha type
Synonyms:
KPCA_BOVIN PRKCA Protein kinase C alpha
Type:
Enzyme
Mol. Mass.:
76842.76
Organism:
Bos taurus (bovine)
Description:
Residue:
672
  
Inhibitor
Name:
BDBM3032
Synonyms:
CHEMBL1204168 N-(3-bromophenyl)-6,7-dimethoxyquinazolin-4-amine US11001595, Compound PD153035 US9422297, PD153035
Type:
Small organic molecule
Emp. Form.:
C16H14BrN3O2
Mol. Mass.:
360.205
SMILES:
COc1cc2ncnc(Nc3cccc(Br)c3)c2cc1OC
:
Substrate
Name:
Protamine Sulfate
Synonyms:
Type:
Other Protein Type
Mol. Mass.:
358.43
Organism:
Description:
A purified mixture of simple protein obtained from the sperm or testes of suitable species of fish.
Residue:
3
NA