Target
Muscarinic acetylcholine receptor M2
Ligand
BDBM50071173
Substrate
Ki
10.2±n/a nM
Comments
PDSP_933
Citation
 Lai, JBloom, JWYamamura, HIRoeske, WR Amplification of the rat M2 muscarinic receptor gene by the polymerase chain reaction: functional expression of the M2 muscarinic receptor. Life Sci 47:1001-13 (1990)  
Target
Name:
Muscarinic acetylcholine receptor M2
Synonyms:
ACM2_RAT Chrm-2 | Chrm2
Type:
Enzyme Catalytic Domain
Mol. Mass.:
51555.53
Organism:
RAT
Description:
P10980
Residue:
466
  
Inhibitor
Name:
BDBM50071173
Synonyms:
(3R,4R,4aS,8aR)-4-[(E)-2-((2S,6S)-1,6-Dimethyl-piperidin-2-yl)-vinyl]-3-methyl-decahydro-naphtho[2,3-c]furan-1-one HIMBACINE
Type:
Small organic molecule
Emp. Form.:
C22H35NO2
Mol. Mass.:
345.5188
SMILES:
C[C@H]1OC(=O)C2C[C@H]3CCCC[C@@H]3[C@@H](\C=C\[C@@H]3CCC[C@H](C)N3C)C12
: