Target
D(2) dopamine receptor
Ligand
BDBM50012855
Substrate
Ki
>10000±n/a nM
Comments
PDSP_4020
Citation
 Andersen, PHGrønvald, FCJansen, JA A comparison between dopamine-stimulated adenylate cyclase and 3H-SCH 23390 binding in rat striatum. Life Sci 37:1971-83 (1985)  
Target
Name:
D(2) dopamine receptor
Synonyms:
DOPAMINE D2 DOPAMINE D2 Short Dopamine D2 receptor Drd2
Type:
G Protein-Coupled Receptor (GPCR)
Mol. Mass.:
50931.60
Organism:
Rattus norvegicus (rat)
Description:
P61169
Residue:
444
  
Inhibitor
Name:
BDBM50012855
Synonyms:
10H-Phenothiazin CHEMBL828 dibenzo-1,4-thiazine | phenothiazine
Type:
Small organic molecule
Emp. Form.:
C12H9NS
Mol. Mass.:
199.272
SMILES:
N1c2ccccc2Sc2ccccc12
: