Target
D(2) dopamine receptor
Ligand
BDBM11638
Substrate
Ki
6.58±n/a nM
Comments
PDSP_1779
Citation
 Sánchez-Roa, PMGrigoriadis, DEWilson, AASharkey, JDannals, RFVillemagne, VLWong, DFWagner, HNKuhar, MJ [125]I-spectramide: a novel benzamide displaying potent and selective effects at the D2 dopamine receptor. Life Sci 45:1821-9 (1989)  
Target
Name:
D(2) dopamine receptor
Synonyms:
DOPAMINE D2 DOPAMINE D2 Short Dopamine D2 receptor Drd2
Type:
G Protein-Coupled Receptor (GPCR)
Mol. Mass.:
50931.60
Organism:
Rattus norvegicus (rat)
Description:
P61169
Residue:
444
  
Inhibitor
Name:
BDBM11638
Synonyms:
CHEMBL26 N-[(1-ethylpyrrolidin-2-yl)methyl]-2-methoxy-5-sulfamoylbenzamide SULPIRIDE,(-) Sulpiride, SLP US10172837, Sulpiride
Type:
Small organic molecule
Emp. Form.:
C15H23N3O4S
Mol. Mass.:
341.426
SMILES:
CCN1CCCC1CNC(=O)c1cc(ccc1OC)S(N)(=O)=O
: