Target
Leucyl-cystinyl aminopeptidase
Ligand
BDBM271188
Substrate
Meas. Tech.
Inhibition of IRAP Assay
IC50
1.70±n/a nM
Citation
 Kawaguchi, KIshihata, AInagaki, YTsuchiya, KHanadate, TKanai, AKaizawa, HKazami, JMorikawa, HHiramoto, MEnjo, KTakamatsu, H Pyridine derivative US Patent  US10059720 Publication Date 8/28/2018 
Target
Name:
Leucyl-cystinyl aminopeptidase
Synonyms:
Cystinyl aminopeptidase Insulin-regulated membrane aminopeptidase Irap Leucyl-cystinyl aminopeptidase Otase P-LAP Vesicle protein of 165 kDa | Vp165
Type:
PROTEIN
Mol. Mass.:
117179.39
Organism:
Rattus norvegicus
Description:
ChEMBL_98523
Residue:
1025
  
Inhibitor
Name:
BDBM271188
Synonyms:
US10059720, Example 4 | US10975091, Example 4
Type:
Small organic molecule
Emp. Form.:
C21H32N2O4
Mol. Mass.:
376.4898
SMILES:
CC(C)C[C@H](N)[C@](O)(Cc1cc(OC2CCC3(CC3)CC2)ccn1)C(O)=O
: