Target
Leucyl-cystinyl aminopeptidase
Ligand
BDBM271226
Substrate
Meas. Tech.
Inhibition of IRAP Assay
IC50
1.80±n/a nM
Citation
 Kawaguchi, KIshihata, AInagaki, YTsuchiya, KHanadate, TKanai, AKaizawa, HKazami, JMorikawa, HHiramoto, MEnjo, KTakamatsu, H Pyridine derivative US Patent  US10059720 Publication Date 8/28/2018 
Target
Name:
Leucyl-cystinyl aminopeptidase
Synonyms:
Cystinyl aminopeptidase Insulin-regulated membrane aminopeptidase Irap Leucyl-cystinyl aminopeptidase Otase P-LAP Vesicle protein of 165 kDa | Vp165
Type:
PROTEIN
Mol. Mass.:
117179.39
Organism:
Rattus norvegicus
Description:
ChEMBL_98523
Residue:
1025
  
Inhibitor
Name:
BDBM271226
Synonyms:
US10059720, Example 41 | US10975091, Example 41
Type:
Small organic molecule
Emp. Form.:
C20H32N2O4
Mol. Mass.:
364.4791
SMILES:
CC(C)C[C@H](N)[C@](O)(Cc1cc(OC2CCCCCC2)ccn1)C(O)=O
: