Target
Leucyl-cystinyl aminopeptidase
Ligand
BDBM271230
Substrate
Meas. Tech.
Inhibition of IRAP Assay
IC50
0.420±n/a nM
Citation
 Kawaguchi, KIshihata, AInagaki, YTsuchiya, KHanadate, TKanai, AKaizawa, HKazami, JMorikawa, HHiramoto, MEnjo, KTakamatsu, H Pyridine derivative US Patent  US10059720 Publication Date 8/28/2018 
Target
Name:
Leucyl-cystinyl aminopeptidase
Synonyms:
Cystinyl aminopeptidase Insulin-regulated membrane aminopeptidase Irap Leucyl-cystinyl aminopeptidase Otase P-LAP Vesicle protein of 165 kDa | Vp165
Type:
PROTEIN
Mol. Mass.:
117179.39
Organism:
Rattus norvegicus
Description:
ChEMBL_98523
Residue:
1025
  
Inhibitor
Name:
BDBM271230
Synonyms:
US10059720, Example 45 | US10975091, Example 45
Type:
Small organic molecule
Emp. Form.:
C28H32N2O6S
Mol. Mass.:
524.628
SMILES:
CS(=O)(=O)c1ccc(cc1)-c1ccc(cc1)[C@H](N)[C@](O)(Cc1cc(OC2CCCCC2)ccn1)C(O)=O
: