Target
Leucyl-cystinyl aminopeptidase
Ligand
BDBM271246
Substrate
Meas. Tech.
Inhibition of Human P-LAP (hP-LAP) Assay
IC50
1.80±n/a nM
Citation
 Kawaguchi, KIshihata, AInagaki, YTsuchiya, KHanadate, TKanai, AKaizawa, HKazami, JMorikawa, HHiramoto, MEnjo, KTakamatsu, H Pyridine derivative US Patent  US10059720 Publication Date 8/28/2018 
Target
Name:
Leucyl-cystinyl aminopeptidase
Synonyms:
Aminopeptidase Cystinyl aminopeptidase Insulin-regulated membrane aminopeptidase LCAP_HUMAN Leucyl-cystinyl aminopeptidase, pregnancy serum form Oxytocinase Placental leucine aminopeptidase
Type:
PROTEIN
Mol. Mass.:
117334.10
Organism:
Homo sapiens (Human)
Description:
ChEMBL_1473494
Residue:
1025
  
Inhibitor
Name:
BDBM271246
Synonyms:
US10059720, Example 61 | US10975091, Example 61
Type:
Small organic molecule
Emp. Form.:
C22H34N2O5
Mol. Mass.:
406.5158
SMILES:
CC(C)C[C@H](N)[C@](O)(Cc1cc(O[C@H]2CC[C@]3(CCCO3)CC2)ccn1)C(O)=O
: