Target
Muscarinic acetylcholine receptor M2
Ligand
BDBM81799
Substrate
Ki
50.2±n/a nM
Comments
PDSP_931
Citation
 McKinney, MAnderson, DForray, Cel-Fakahany, EE Characterization of the striatal M2 muscarinic receptor mediating inhibition of cyclic AMP using selective antagonists: a comparison with the brainstem M2 receptor. J Pharmacol Exp Ther 250:565-72 (1989) Target
Name:
Muscarinic acetylcholine receptor M2
Synonyms:
ACM2_RAT Chrm-2 | Chrm2
Type:
Enzyme Catalytic Domain
Mol. Mass.:
51555.53
Organism:
RAT
Description:
P10980
Residue:
466
  
Inhibitor
Name:
BDBM81799
Synonyms:
CAS_98299-40-2 NSC_3602 | hexahydrosiladifenidol
Type:
Small organic molecule
Emp. Form.:
C20H33NOSi
Mol. Mass.:
331.5676
SMILES:
O[Si](CCCN1CCCCC1)(C1CCCCC1)c1ccccc1
: