Target
5-hydroxytryptamine receptor 3A
Ligand
BDBM50001898
Substrate
Ki
430±n/a nM
Comments
PDSP_5045
Citation
 Glennon, RAIsmaiel, AEMcCarthy, BGPeroutka, SJ Binding of arylpiperazines to 5-HT3 serotonin receptors: results of a structure-affinity study. Eur J Pharmacol 168:387-92 (1989)  
Target
Name:
5-hydroxytryptamine receptor 3A
Synonyms:
5-HT3 5HT3A_RAT Htr3 Serotonin (5-HT) receptor | Zacopride site-R
Type:
Enzyme Catalytic Domain
Mol. Mass.:
55428.70
Organism:
RAT
Description:
5-HT3 HTR3A RAT::P35563
Residue:
483
  
Inhibitor
Name:
BDBM50001898
Synonyms:
1-Phenyl-piperazine PHENYLPIPERAZINE
Type:
Small organic molecule
Emp. Form.:
C10H14N2
Mol. Mass.:
162.2316
SMILES:
C1CN(CCN1)c1ccccc1
: