Target
5-hydroxytryptamine receptor 2B
Ligand
BDBM50005265
Substrate
Ki
400±n/a nM
Comments
PDSP_724
Citation
 McKenna, DJPeroutka, SJ Differentiation of 5-hydroxytryptamine2 receptor subtypes using 125I-R-(-)2,5-dimethoxy-4-iodo-phenylisopropylamine and 3H-ketanserin. J Neurosci 9:3482-90 (1989) Target
Name:
5-hydroxytryptamine receptor 2B
Synonyms:
5-HT2B HTR2B
Type:
Enzyme Catalytic Domain
Mol. Mass.:
15564.62
Organism:
BOVINE
Description:
Q8MI09
Residue:
137
  
Inhibitor
Name:
BDBM50005265
Synonyms:
(+/-)2-(2,5-Dimethoxy-4-methyl-phenyl)-1-methyl-ethylamine (Rec)2-(2,5-Dimethoxy-4-methyl-phenyl)-1-methyl-ethylamine; compound with 2-(2,5-dimethoxy-4-methyl-phenyl)-1-methyl-ethylamine 2-(2,5-Dimethoxy-4-methyl-phenyl)-1-methyl-ethylamine((R)-(-)-DOM) CHEMBL8600 DOM,R(-) | Racemic DOM
Type:
Small organic molecule
Emp. Form.:
C12H19NO2
Mol. Mass.:
209.2848
SMILES:
COc1cc(CC(C)N)c(OC)cc1C
: