Target
Alpha-1A adrenergic receptor
Ligand
BDBM50026044
Substrate
Ki
320±n/a nM
Comments
PDSP_2280
Citation
 Hall, HSällemark, MJerning, E Effects of remoxipride and some related new substituted salicylamides on rat brain receptors. Acta Pharmacol Toxicol (Copenh) 58:61-70 (1986)  
Target
Name:
Alpha-1A adrenergic receptor
Synonyms:
ADA1A_RAT Adra1c Alpha-1A adrenoceptor Alpha-1C adrenergic receptor | adrenergic Alpha1A
Type:
Protein
Mol. Mass.:
51620.15
Organism:
Rattus norvegicus (Rat)
Description:
P43140
Residue:
466
  
Inhibitor
Name:
BDBM50026044
Synonyms:
3-Bromo-5-ethyl-N-(1-ethyl-pyrrolidin-2-ylmethyl)-6-hydroxy-2-methoxy-benzamide CHEMBL161668
Type:
Small organic molecule
Emp. Form.:
C17H25BrN2O3
Mol. Mass.:
385.296
SMILES:
CCN1CCC[C@H]1CNC(=O)c1c(O)c(CC)cc(Br)c1OC
: