Target
D(2) dopamine receptor
Ligand
BDBM50026044
Substrate
Ki
1±n/a nM
Comments
PDSP_2280
Citation
 Hall, HSällemark, MJerning, E Effects of remoxipride and some related new substituted salicylamides on rat brain receptors. Acta Pharmacol Toxicol (Copenh) 58:61-70 (1986)  
Target
Name:
D(2) dopamine receptor
Synonyms:
DOPAMINE D2 DOPAMINE D2 Short Dopamine D2 receptor Drd2
Type:
G Protein-Coupled Receptor (GPCR)
Mol. Mass.:
50931.60
Organism:
Rattus norvegicus (rat)
Description:
P61169
Residue:
444
  
Inhibitor
Name:
BDBM50026044
Synonyms:
3-Bromo-5-ethyl-N-(1-ethyl-pyrrolidin-2-ylmethyl)-6-hydroxy-2-methoxy-benzamide CHEMBL161668
Type:
Small organic molecule
Emp. Form.:
C17H25BrN2O3
Mol. Mass.:
385.296
SMILES:
CCN1CCC[C@H]1CNC(=O)c1c(O)c(CC)cc(Br)c1OC
: