Target
D(2) dopamine receptor
Ligand
BDBM50026051
Substrate
Ki
1.5±n/a nM
Comments
PDSP_2281
Citation
 Hall, HSällemark, MJerning, E Effects of remoxipride and some related new substituted salicylamides on rat brain receptors. Acta Pharmacol Toxicol (Copenh) 58:61-70 (1986)  
Target
Name:
D(2) dopamine receptor
Synonyms:
DOPAMINE D2 DOPAMINE D2 Short Dopamine D2 receptor Drd2
Type:
G Protein-Coupled Receptor (GPCR)
Mol. Mass.:
50931.60
Organism:
Rattus norvegicus (rat)
Description:
P61169
Residue:
444
  
Inhibitor
Name:
BDBM50026051
Synonyms:
3,5-Dichloro-N-(1-ethyl-pyrrolidin-2-ylmethyl)-2-hydroxy-6-methoxy-benzamide A 38120 | CHEMBL62429
Type:
Small organic molecule
Emp. Form.:
C19H30N2O3
Mol. Mass.:
334.4531
SMILES:
CCN1CCC[C@H]1CNC(=O)c1c(O)c(CC)cc(CC)c1OC
: