Target
Alpha-2C adrenergic receptor
Ligand
BDBM50016897
Substrate
Ki
41.9±n/a nM
Comments
PDSP_544
Citation
 Boyajian, CLLeslie, FM Pharmacological evidence for alpha-2 adrenoceptor heterogeneity: differential binding properties of [3H]rauwolscine and [3H]idazoxan in rat brain. J Pharmacol Exp Ther 241:1092-8 (1987) Target
Name:
Alpha-2C adrenergic receptor
Synonyms:
ADA2C_RAT Adrenergic receptor alpha adrenergic Alpha2 | adrenergic Alpha2C
Type:
Enzyme Catalytic Domain
Mol. Mass.:
49890.50
Organism:
RAT
Description:
adrenergic Alpha2 0 RAT::P22086
Residue:
458
  
Inhibitor
Name:
BDBM50016897
Synonyms:
2-(2,6-dichloroanilino)-1,3-diazacyclopentene-(2) CLONIDINE clonidine (amino form)
Type:
Small organic molecule
Emp. Form.:
C9H9Cl2N3
Mol. Mass.:
230.094
SMILES:
Clc1cccc(Cl)c1\[#7]=[#6]-1\[#7]-[#6]-[#6]-[#7]-1
: