Target
D(1A) dopamine receptor
Ligand
BDBM21398
Substrate
Ki
76±n/a nM
Comments
PDSP_918
Citation
 Andersen, PH Comparison of the pharmacological characteristics of [3H]raclopride and [3H]SCH 23390 binding to dopamine receptors in vivo in mouse brain. Eur J Pharmacol 146:113-20 (1988)  
Target
Name:
D(1A) dopamine receptor
Synonyms:
D(1A) dopamine receptor DRD1_MOUSE Dopamine receptor Drd1a | Gpcr15
Type:
Enzyme
Mol. Mass.:
49613.93
Organism:
Mus musculus (Mouse)
Description:
Q61616
Residue:
446
  
Inhibitor
Name:
BDBM21398
Synonyms:
4-[4-(4-Chloro-phenyl)-4-hydroxy-piperidin-1-yl]-1-(4-fluoro-phenyl)-butan-1-one;propionate(HCl) CHEMBL54 Haloperidol | Haloperidol, 1
Type:
Small organic molecule
Emp. Form.:
C21H23ClFNO2
Mol. Mass.:
375.864
SMILES:
OC1(CCN(CCCC(=O)c2ccc(F)cc2)CC1)c1ccc(Cl)cc1
: