Target
Muscarinic acetylcholine receptor M2
Ligand
BDBM50131440
Substrate
Ki
71.42±n/a nM
Comments
PDSP_1205
Citation
 Richelson, E Neuroleptic binding to human brain receptors: relation to clinical effects. Ann N Y Acad Sci 537:435-42 (1988)  
Target
Name:
Muscarinic acetylcholine receptor M2
Synonyms:
ACM2_HUMAN Cholinergic, muscarinic M2 Muscarinic acetylcholine receptor M2 and M5 | RecName: Full=Muscarinic acetylcholine receptor M2
Type:
GPCR
Mol. Mass.:
51730.61
Organism:
Homo sapiens (Human)
Description:
P08172
Residue:
466
  
Inhibitor
Name:
BDBM50131440
Synonyms:
10-(2-(1-methylpiperidin-2-yl)ethyl)-2-(methylsulfinyl)-10H-phenothiazine CHEMBL1088 NC-123 TPS-23
Type:
Small organic molecule
Emp. Form.:
C21H26N2OS2
Mol. Mass.:
386.574
SMILES:
CN1CCCCC1CCN1c2ccccc2Sc2ccc(cc12)S(C)=O
: