Target
D(2) dopamine receptor
Ligand
BDBM81995
Substrate
Ki
2900±n/a nM
Comments
PDSP_730
Citation
 Lin, CMcGonigle, PMolinoff, PB Characterization of D-2 dopamine receptors in a tumor of the rat anterior pituitary gland. J Pharmacol Exp Ther 242:950-6 (1987) Target
Name:
D(2) dopamine receptor
Synonyms:
DOPAMINE D2 DOPAMINE D2 Short Dopamine D2 receptor Drd2
Type:
G Protein-Coupled Receptor (GPCR)
Mol. Mass.:
50931.60
Organism:
Rattus norvegicus (rat)
Description:
P61169
Residue:
444
  
Inhibitor
Name:
BDBM81995
Synonyms:
Dopamine+ (GTP-)
Type:
Emp. Form.:
C10H15N5O14P3
Mol. Mass.:
522.173
SMILES:
Nc1nc2n(cnc2c(=O)[nH]1)[C@H]1O[C@H](COP(O)(=O)OP(O)(=O)OP(O)([O-])=O)[C@@H](O)[C@H]1O
: