Target
Sigma non-opioid intracellular receptor 1
Ligand
BDBM50013388
Substrate
Ki
229±n/a nM
Comments
PDSP_413
Citation
 Mendelsohn, LGKalra, VJohnson, BGKerchner, GA Sigma opioid receptor: characterization and co-identity with the phencyclidine receptor. J Pharmacol Exp Ther 233:597-602 (1985) Target
Name:
Sigma non-opioid intracellular receptor 1
Synonyms:
Opioid receptor SGMR1_RAT Sigma non-opioid intracellular receptor 1 Sigma-1 | Sigmar1
Type:
Enzyme Catalytic Domain
Mol. Mass.:
25266.54
Organism:
RAT
Description:
Q9R0C9
Residue:
223
  
Inhibitor
Name:
BDBM50013388
Synonyms:
6-Ethyl-3-(1-hydroxy-cyclopropylmethyl)-11,11-dimethyl-1,2,3,4,5,6-hexahydro-2,6-methano-benzo[d]azocin-8-ol Bremazocine | CHEMBL350384
Type:
Small organic molecule
Emp. Form.:
C20H29NO2
Mol. Mass.:
315.4498
SMILES:
CCC12CCN(CC3(O)CC3)C(Cc3ccc(O)cc13)C2(C)C
: