Target
Glutamate receptor ionotropic, NMDA 1
Ligand
BDBM26431
Substrate
Ki
9600±n/a nM
Comments
PDSP_2030
Citation
 Robinson, MBCrooks, SLJohnson, RLKoerner, JF Displacement of DL-[3H]-2-amino-4-phosphonobutanoic acid ( [3H]APB) binding with methyl-substituted APB analogues and glutamate agonists. Biochemistry 24:2401-5 (1985)  
Target
Name:
Glutamate receptor ionotropic, NMDA 1
Synonyms:
Glutamate (NMDA) receptor subunit zeta 1 Glutamate-NMDA-Channel Glutamate-NMDA-Polyamine NMDA Nmdar1 | phencyclidine
Type:
Enzyme Catalytic Domain
Mol. Mass.:
105533.40
Organism:
RAT
Description:
P35439
Residue:
938
  
Inhibitor
Name:
BDBM26431
Synonyms:
(2R)-2-aminopentanedioic acid D-Glu D-[14C]Glu
Type:
radiolabeled amino acid
Emp. Form.:
C5H9NO4
Mol. Mass.:
147.1293
SMILES:
N[C@H](CCC(O)=O)C(O)=O
: