Target
Adenosine receptor A1
Ligand
BDBM82032
Substrate
Ki
450±n/a nM
Comments
PDSP_2496
Citation
 Bruns, RFLu, GHPugsley, TA Characterization of the A2 adenosine receptor labeled by [3H]NECA in rat striatal membranes. Mol Pharmacol 29:331-46 (1986) Target
Name:
Adenosine receptor A1
Synonyms:
AA1R_RAT ADENOSINE A1 high Adenosine A1 receptor (A1) Adenosine receptors A1 | Adora1
Type:
Protein
Mol. Mass.:
36704.13
Organism:
Rattus norvegicus (rat)
Description:
Residue:
326
  
Inhibitor
Name:
BDBM82032
Synonyms:
1,3-Dipropyl-3,7-dihydro-purine-2,6-dione CAS_169317 CPX | NSC_169317
Type:
Small organic molecule
Emp. Form.:
C11H16N4O2
Mol. Mass.:
236.2703
SMILES:
CCCn1c2nc[nH]c2c(=O)n(CCC)c1=O
: