Target
Adenosine receptor A1
Ligand
BDBM50118810
Substrate
Ki
1.17±n/a nM
Comments
PDSP_2555
Citation
 Bruns, RFLu, GHPugsley, TA Characterization of the A2 adenosine receptor labeled by [3H]NECA in rat striatal membranes. Mol Pharmacol 29:331-46 (1986) Target
Name:
Adenosine receptor A1
Synonyms:
AA1R_RAT ADENOSINE A1 high Adenosine A1 receptor (A1) Adenosine receptors A1 | Adora1
Type:
Protein
Mol. Mass.:
36704.13
Organism:
Rattus norvegicus (rat)
Description:
Residue:
326
  
Inhibitor
Name:
BDBM50118810
Synonyms:
(2R,3S,4R,5R)-2-(hydroxymethyl)-5-(6-((R)-1-phenylpropan-2-ylamino)-9H-purin-9-yl)-tetrahydrofuran-3,4-diol CHEMBL139000 R-N6-(phenylisopropyl)adenosine
Type:
Small organic molecule
Emp. Form.:
C19H23N5O4
Mol. Mass.:
385.417
SMILES:
C[C@H](Cc1ccccc1)Nc1ncnc2n(cnc12)[C@@H]1O[C@H](CO)[C@@H](O)[C@H]1O
: