Target
Adenosine receptor A2a
Ligand
BDBM82046
Substrate
Ki
>10000±n/a nM
Comments
PDSP_2539
Citation
 Bruns, RFLu, GHPugsley, TA Characterization of the A2 adenosine receptor labeled by [3H]NECA in rat striatal membranes. Mol Pharmacol 29:331-46 (1986) Target
Name:
Adenosine receptor A2a
Synonyms:
A2A adenosine receptor (hA2A) ADENOSINE A2 ADORA2 Adenosine A2A receptor (A2AAR)
Type:
G Protein-Coupled Receptor (GPCR)
Mol. Mass.:
44716.46
Organism:
Homo sapiens (Human)
Description:
P29274
Residue:
412
  
Inhibitor
Name:
BDBM82046
Synonyms:
1-Butyltheobromine NSC_70835
Type:
Small organic molecule
Emp. Form.:
C11H16N4O2
Mol. Mass.:
236.2703
SMILES:
CCCCn1c(=O)n(C)c2ncn(C)c2c1=O
: