Target
Adenosine receptor A2a
Ligand
BDBM82031
Substrate
Ki
331±n/a nM
Comments
PDSP_2514
Citation
 Bruns, RFLu, GHPugsley, TA Characterization of the A2 adenosine receptor labeled by [3H]NECA in rat striatal membranes. Mol Pharmacol 29:331-46 (1986) Target
Name:
Adenosine receptor A2a
Synonyms:
AA2AR_RAT Adenosine A2 receptor Adenosine Receptors A2a (A2a) Adenosine receptors A2a Rat striatal adenosine A2a receptor
Type:
G Protein-Coupled Receptor (GPCR)
Mol. Mass.:
45015.65
Organism:
Rattus norvegicus (rat)
Description:
Rat A2A receptors expressed in CHO cells.
Residue:
410
  
Inhibitor
Name:
BDBM82031
Synonyms:
2-Oxoado (isoguanosine) isoguanosine
Type:
Small organic molecule
Emp. Form.:
C10H13N5O5
Mol. Mass.:
283.2407
SMILES:
Nc1[nH]c(=O)nc2n(cnc12)[C@@H]1O[C@H](CO)[C@@H](O)[C@H]1O
: