Target
Adenosine receptor A2a
Ligand
BDBM50001493
Substrate
Ki
>10000±n/a nM
Comments
PDSP_2542
Citation
 Bruns, RFLu, GHPugsley, TA Characterization of the A2 adenosine receptor labeled by [3H]NECA in rat striatal membranes. Mol Pharmacol 29:331-46 (1986) Target
Name:
Adenosine receptor A2a
Synonyms:
A2A adenosine receptor (hA2A) ADENOSINE A2 ADORA2 Adenosine A2A receptor (A2AAR)
Type:
G Protein-Coupled Receptor (GPCR)
Mol. Mass.:
44716.46
Organism:
Homo sapiens (Human)
Description:
P29274
Residue:
412
  
Inhibitor
Name:
BDBM50001493
Synonyms:
3-Propyl-3,7-dihydro-purine-2,6-dione 3-Propylxanthine (enprofylline) ENPROFYLLINE
Type:
Small organic molecule
Emp. Form.:
C8H10N4O2
Mol. Mass.:
194.1906
SMILES:
CCCn1c2nc[nH]c2c(=O)[nH]c1=O
: