Target
Adenosine receptor A2a
Ligand
BDBM82054
Substrate
Ki
57.5±n/a nM
Comments
PDSP_2519
Citation
 Bruns, RFLu, GHPugsley, TA Characterization of the A2 adenosine receptor labeled by [3H]NECA in rat striatal membranes. Mol Pharmacol 29:331-46 (1986) Target
Name:
Adenosine receptor A2a
Synonyms:
AA2AR_RAT Adenosine A2 receptor Adenosine Receptors A2a (A2a) Adenosine receptors A2a Rat striatal adenosine A2a receptor
Type:
G Protein-Coupled Receptor (GPCR)
Mol. Mass.:
45015.65
Organism:
Rattus norvegicus (rat)
Description:
Rat A2A receptors expressed in CHO cells.
Residue:
410
  
Inhibitor
Name:
BDBM82054
Synonyms:
Ado-5'-(2-hydroxyethyl)carboxamide
Type:
Emp. Form.:
C13H18N6O5
Mol. Mass.:
338.3192
SMILES:
NC(=O)CCOC[C@H]1O[C@H]([C@H](O)[C@@H]1O)n1cnc2c(N)ncnc12
: