Target
Adenosine receptor A2a
Ligand
BDBM50098221
Substrate
Ki
2240±n/a nM
Comments
PDSP_2511
Citation
 Bruns, RFLu, GHPugsley, TA Characterization of the A2 adenosine receptor labeled by [3H]NECA in rat striatal membranes. Mol Pharmacol 29:331-46 (1986) Target
Name:
Adenosine receptor A2a
Synonyms:
A2A adenosine receptor (hA2A) ADENOSINE A2 ADORA2 Adenosine A2A receptor (A2AAR)
Type:
G Protein-Coupled Receptor (GPCR)
Mol. Mass.:
44716.46
Organism:
Homo sapiens (Human)
Description:
P29274
Residue:
412
  
Inhibitor
Name:
BDBM50098221
Synonyms:
4-Butylamino-1-ethyl-1H-pyrazolo[3,4-b]pyridine-5-carboxylic acid ethyl ester Cartazolate | ethyl 4-(butylamino)-1-ethyl-1H-pyrazolo[3,4-b]pyridine-5-carboxylate
Type:
Small organic molecule
Emp. Form.:
C15H22N4O2
Mol. Mass.:
290.3608
SMILES:
CCCCNc1c(cnc2n(CC)ncc12)C(=O)OCC
: