Target
Adenosine receptor A2a
Ligand
BDBM82050
Substrate
Ki
6330±n/a nM
Comments
PDSP_2553
Citation
 Bruns, RFLu, GHPugsley, TA Characterization of the A2 adenosine receptor labeled by [3H]NECA in rat striatal membranes. Mol Pharmacol 29:331-46 (1986) Target
Name:
Adenosine receptor A2a
Synonyms:
AA2AR_RAT Adenosine A2 receptor Adenosine Receptors A2a (A2a) Adenosine receptors A2a Rat striatal adenosine A2a receptor
Type:
G Protein-Coupled Receptor (GPCR)
Mol. Mass.:
45015.65
Organism:
Rattus norvegicus (rat)
Description:
Rat A2A receptors expressed in CHO cells.
Residue:
410
  
Inhibitor
Name:
BDBM82050
Synonyms:
N6-[3-(4-Chlorophenyl)bicyclo[2.2.2]oct-2-yl]ado (EMD 28422)
Type:
Small organic molecule
Emp. Form.:
C24H28ClN5O4
Mol. Mass.:
485.963
SMILES:
OC[C@H]1O[C@H]([C@H](O)[C@@H]1O)n1cnc2c(NC34CCC(CC3)CC4c3ccc(Cl)cc3)ncnc12
: