Target
Glutamate receptor ionotropic, NMDA 1
Ligand
BDBM50010617
Substrate
Ki
>10000±n/a nM
Comments
PDSP_95
Citation
 Largent, BLGundlach, ALSnyder, SH Pharmacological and autoradiographic discrimination of sigma and phencyclidine receptor binding sites in brain with (+)-[3H]SKF 10,047, (+)-[3H]-3-[3-hydroxyphenyl]-N-(1-propyl)piperidine and [3H]-1-[1-(2-thienyl)cyclohexyl]piperidine. J Pharmacol Exp Ther 238:739-48 (1986) Target
Name:
Glutamate receptor ionotropic, NMDA 1
Synonyms:
Glutamate (NMDA) receptor subunit zeta 1 Glutamate-NMDA-Channel Glutamate-NMDA-Polyamine NMDA Nmdar1 | phencyclidine
Type:
Enzyme Catalytic Domain
Mol. Mass.:
105533.40
Organism:
RAT
Description:
P35439
Residue:
938
  
Inhibitor
Name:
BDBM50010617
Synonyms:
(-)-3-(1-Propyl-piperidin-3-yl)-phenol 3-((S)-1-Propyl-piperidin-3-yl)-phenol 3PPP,(+) Preclamol
Type:
Small organic molecule
Emp. Form.:
C14H21NO
Mol. Mass.:
219.3226
SMILES:
CCCN1CCC[C@H](C1)c1cccc(O)c1
: