Target
Mu-type opioid receptor
Ligand
BDBM21025
Substrate
Ki
4.9±n/a nM
Comments
PDSP_614
Citation
 Blanchard, SGLee, PHPugh, WWHong, JSChang, KJ Characterization of the binding of a morphine (mu) receptor-specific ligand: Tyr-Pro-NMePhe-D-Pro-NH2, [3H]-PL17. Mol Pharmacol 31:326-33 (1987) Target
Name:
Mu-type opioid receptor
Synonyms:
MOR-1 Mu-type opioid receptor (MOR) OPRM_RAT Opioid receptor B Ror-b
Type:
G Protein-Coupled Receptor (GPCR)
Mol. Mass.:
44503.11
Organism:
Rattus norvegicus (rat)
Description:
Competition binding assays were carried out using membrane preparations from transfected HN9.10 cells that constitutively expressed the mu opioid receptor.
Residue:
398
  
Inhibitor
Name:
BDBM21025
Synonyms:
(2R)-2-[(2S)-2-{2-[(2R)-2-[(2S)-2-amino-3-(4-hydroxyphenyl)propanamido]propanamido]acetamido}-3-phenylpropanamido]-4-methylpentanoic acid BW-180C DADLE H-Tyr-D-Ala-Gly-Phe-D-Leu-OH | [D-Ala2-D-Leu5]enkephalin
Type:
ANALGESIC
Emp. Form.:
C29H39N5O7
Mol. Mass.:
569.6493
SMILES:
CC(C)C[C@@H](NC(=O)[C@H](Cc1ccccc1)NC(=O)CNC(=O)[C@@H](C)NC(=O)[C@@H](N)Cc1ccc(O)cc1)C(O)=O
: