Target
Sigma non-opioid intracellular receptor 1
Ligand
BDBM50010618
Substrate
Ki
155±n/a nM
Comments
PDSP_94
Citation
 Largent, BLGundlach, ALSnyder, SH Psychotomimetic opiate receptors labeled and visualized with (+)-[3H]3-(3-hydroxyphenyl)-N-(1-propyl)piperidine. Proc Natl Acad Sci U S A 81:4983-7 (1984)  
Target
Name:
Sigma non-opioid intracellular receptor 1
Synonyms:
Opioid receptor SGMR1_RAT Sigma non-opioid intracellular receptor 1 Sigma-1 | Sigmar1
Type:
Enzyme Catalytic Domain
Mol. Mass.:
25266.54
Organism:
RAT
Description:
Q9R0C9
Residue:
223
  
Inhibitor
Name:
BDBM50010618
Synonyms:
(+)-3-(1-Propyl-piperidin-3-yl)-phenol 3-(1-Propyl-piperidin-3-yl)-phenol CHEMBL7393 | cid_202478
Type:
Small organic molecule
Emp. Form.:
C14H21NO
Mol. Mass.:
219.3226
SMILES:
CCCN1CCC[C@@H](C1)c1cccc(O)c1
: