Target
Sigma non-opioid intracellular receptor 1
Ligand
BDBM82078
Substrate
Ki
>10000±n/a nM
Comments
PDSP_1308
Citation
 Largent, BLGundlach, ALSnyder, SH Psychotomimetic opiate receptors labeled and visualized with (+)-[3H]3-(3-hydroxyphenyl)-N-(1-propyl)piperidine. Proc Natl Acad Sci U S A 81:4983-7 (1984)  
Target
Name:
Sigma non-opioid intracellular receptor 1
Synonyms:
Opioid receptor SGMR1_RAT Sigma non-opioid intracellular receptor 1 Sigma-1 | Sigmar1
Type:
Enzyme Catalytic Domain
Mol. Mass.:
25266.54
Organism:
RAT
Description:
Q9R0C9
Residue:
223
  
Inhibitor
Name:
BDBM82078
Synonyms:
CAS_55508-42-4 Neurotensin
Type:
Small organic molecule
Emp. Form.:
C36H58N8O9
Mol. Mass.:
746.8939
SMILES:
CCC(C)C(NC(=O)C(Cc1ccc(O)cc1)NC(=O)C1CCCN1C(=O)C(CC(N)=O)NC(=O)C(N)CCCCN)C(=O)NC(CC(C)C)C(O)=O
: