Target
Histamine H1 receptor
Ligand
BDBM28347
Substrate
Ki
5.8±n/a nM
Comments
PDSP_1203
Citation
 Kanba, SRichelson, E Histamine H1 receptors in human brain labelled with [3H]doxepin. Brain Res 304:1-7 (1984)  
Target
Name:
Histamine H1 receptor
Synonyms:
H1R HISTAMINE H1 HRH1_HUMAN
Type:
G Protein-Coupled Receptor (GPCR)
Mol. Mass.:
55808.72
Organism:
Homo sapiens (Human)
Description:
Cell pellets from SK-N-MC cells transfected with human H1 receptor were used in binding assay.
Residue:
487
  
Inhibitor
Name:
BDBM28347
Synonyms:
3-(10H-phenothiazin-10-ylmethyl)-1-azabicyclo[2.2.2]octan-1-ium ZINC01567421, 6
Type:
Small organic molecule
Emp. Form.:
C20H23N2S
Mol. Mass.:
323.474
SMILES:
C(C1C[NH+]2CCC1CC2)N1c2ccccc2Sc2ccccc12
: