Target
Alpha-2A adrenergic receptor
Ligand
BDBM78433
Substrate
Ki
1550±n/a nM
Comments
PDSP_837
Citation
 Richelson, ENelson, A Antagonism by neuroleptics of neurotransmitter receptors of normal human brain in vitro. Eur J Pharmacol 103:197-204 (1984)  
Target
Name:
Alpha-2A adrenergic receptor
Synonyms:
ADA2A_HUMAN ADRA2R Adrenergic alpha2A Alpha-2 adrenergic receptor subtype C10 Alpha-2A adrenoreceptor alpha-2A adrenergic receptor [Homo sapiens]
Type:
Enzyme
Mol. Mass.:
48979.91
Organism:
Homo sapiens (Human)
Description:
P08913
Residue:
450
  
Inhibitor
Name:
BDBM78433
Synonyms:
2-[4-[3-[2-(trifluoromethyl)-10-phenothiazinyl]propyl]-1-piperazinyl]ethanol;hydrochloride 2-[4-[3-[2-(trifluoromethyl)phenothiazin-10-yl]propyl]piperazino]ethanol;hydrochloride FLUPHENAZINE HYDROCHLORIDE SMR000058411 cid_6602611 | med.21724, Compound 17
Type:
Small organic molecule
Emp. Form.:
C22H26F3N3OS
Mol. Mass.:
437.522
SMILES:
OCCN1CCN(CCCN2c3ccccc3Sc3ccc(cc23)C(F)(F)F)CC1
: