Target
Muscarinic acetylcholine receptor M2
Ligand
BDBM78434
Substrate
Ki
540±n/a nM
Comments
PDSP_1531
Citation
 Richelson, ENelson, A Antagonism by neuroleptics of neurotransmitter receptors of normal human brain in vitro. Eur J Pharmacol 103:197-204 (1984)  
Target
Name:
Muscarinic acetylcholine receptor M2
Synonyms:
ACM2_HUMAN Cholinergic, muscarinic M2 Muscarinic acetylcholine receptor M2 and M5 | RecName: Full=Muscarinic acetylcholine receptor M2
Type:
GPCR
Mol. Mass.:
51730.61
Organism:
Homo sapiens (Human)
Description:
P08172
Residue:
466
  
Inhibitor
Name:
BDBM78434
Synonyms:
2-chloranyl-10-[3-(4-methylpiperazin-1-yl)propyl]phenothiazine;ethane-1,2-disulfonic acid 2-chloro-10-[3-(4-methylpiperazin-1-yl)propyl]phenothiazine;ethane-1,2-disulfonic acid Compazine MLS001148133 SMR000653454 | cid_91499
Type:
Small organic molecule
Emp. Form.:
C20H24ClN3S
Mol. Mass.:
373.943
SMILES:
CN1CCN(CCCN2c3ccccc3Sc3ccc(Cl)cc23)CC1
: