Target
D(2) dopamine receptor
Ligand
BDBM67544
Substrate
Ki
2.8±n/a nM
Comments
PDSP_1909
Citation
 Richelson, ENelson, A Antagonism by neuroleptics of neurotransmitter receptors of normal human brain in vitro. Eur J Pharmacol 103:197-204 (1984)  
Target
Name:
D(2) dopamine receptor
Synonyms:
D(2) dopamine receptor DOPAMINE D2 Long DRD2 Dopamine D2 receptor Dopamine D2 receptor (D2R) Dopamine2-like | d2
Type:
Cell-surface receptors
Mol. Mass.:
50647.10
Organism:
Homo sapiens (Human)
Description:
P14416
Residue:
443
  
Inhibitor
Name:
BDBM67544
Synonyms:
N,N-dimethyl-3-[2-(trifluoromethyl)-10-phenothiazinyl]-1-propanamine;hydrochloride SR-01000000224-4 cid_66069 med.21724, Compound Triflupromazine
Type:
Small organic molecule
Emp. Form.:
C18H19F3N2S
Mol. Mass.:
352.417
SMILES:
CN(C)CCCN1c2ccccc2Sc2ccc(cc12)C(F)(F)F
: