Target
Opioid receptor delta 1
Ligand
BDBM50021325
Substrate
Ki
35.6±n/a nM
Comments
PDSP_669
Citation
 Leslie, FMChavkin, CCox, BM Opioid binding properties of brain and peripheral tissues: evidence for heterogeneity in opioid ligand binding sites. J Pharmacol Exp Ther 214:395-402 (1980) Target
Name:
Opioid receptor delta 1
Synonyms:
Type:
PROTEIN
Mol. Mass.:
40708.41
Organism:
Bos taurus
Description:
ChEMBL_863801
Residue:
372
  
Inhibitor
Name:
BDBM50021325
Synonyms:
4-methyl-(1S,5R,13R,14S)-12-oxa-4-azapentacyclo[9.6.1.01,13.05,17.07,18]octadeca-7(18),8,10-triene-10,14-diol(DHM) DIHYDROMORPHINE
Type:
Small organic molecule
Emp. Form.:
C17H21NO3
Mol. Mass.:
287.3535
SMILES:
CN1CC[C@@]23[C@H]4Oc5c2c(C[C@@H]1C3CC[C@@H]4O)ccc5O
: