Target
Carbonic anhydrase 7
Ligand
BDBM82104
Substrate
Meas. Tech.
Inhibition Assay
pH
7.5±0
Temperature
293.15±0 K
Ki
1.3±0.0 nM
Citation
 De Simone, GScozzafava, ASupuran, CT Which carbonic anhydrases are targeted by the antiepileptic sulfonamides and sulfamates? Chem Biol Drug Des 74:317-21 (2009)  
Target
Name:
Carbonic anhydrase 7
Synonyms:
CA-VII CAH7_HUMAN Carbonic anhydrase Carbonic anhydrase VII (CA VII)
Type:
Enzyme
Mol. Mass.:
29664.11
Organism:
Homo sapiens (Human)
Description:
Human cloned isozyme.
Residue:
264
  
Inhibitor
Name:
BDBM82104
Synonyms:
Investigational agent, 5
Type:
Small organic molecule
Emp. Form.:
C13H19N5O3S2
Mol. Mass.:
357.452
SMILES:
NS(=O)(=O)c1nnc(NC(=O)N[C@]23C[C@H]4C[C@H](C[C@H](C4)C2)C3)s1
: