Target
Endoplasmic reticulum chaperone BiP
Ligand
BDBM82124
Substrate
Meas. Tech.
SPR assay
pH
7.4±0
Temperature
298.15±0 K
Kd
2.17e+3±n/a nM
KOFF
0.005 s-1
Citation
 Macias, ATWilliamson, DSAllen, NBorgognoni, JClay, ADaniels, ZDokurno, PDrysdale, MJFrancis, GLGraham, CJHowes, RMatassova, NMurray, JBParsons, RShaw, TSurgenor, AETerry, LWang, YWood, MMassey, AJ Adenosine-derived inhibitors of 78 kDa glucose regulated protein (Grp78) ATPase: insights into isoform selectivity. J Med Chem 54:4034-41 (2011)  
Target
Name:
Endoplasmic reticulum chaperone BiP
Synonyms:
3.6.4.10 BIP_HUMAN Binding-immunoglobulin protein Endoplasmic reticulum lumenal Ca(2+)-binding protein grp78 GRP78 HSPA5 Heat shock protein 70 family protein 5 Immunoglobulin heavy chain-binding protein | Synonyms=GRP78
Type:
Mol. Mass.:
72312.92
Organism:
Homo sapiens (Human)
Description:
P11021
Residue:
654
  
Inhibitor
Name:
BDBM82124
Synonyms:
adenosine-derived inhibitor (Grp78), 1
Type:
Small organic molecule
Emp. Form.:
C10H14N5O10P2
Mol. Mass.:
426.1937
SMILES:
Nc1ncnc2n(cnc12)[C@@H]1O[C@H](COP(O)(=O)OP(O)([O-])=O)[C@@H](O)[C@H]1O
: