Target
Alpha-1,6-mannosyl-glycoprotein 2-beta-N-acetylglucosaminyltransferase
Ligand
BDBM272063
Substrate
Meas. Tech.
MGAT2 Human Assay
Temperature
298.15±n/a K
IC50
1.60±n/a nM
Comments
extracted
Citation
 Berger, RBlizzard, TACampbell, BTChen, HYDebenham, JSDewnani, SVDubois, BGude, CGuo, ZZHarper, BHu, ZLin, SLiu, PWang, MUjjainwalla, FXu, JXu, LZhang, R Isoquinoline derivatives as MGAT2 inhibitors US Patent  US10065945 Publication Date 9/4/2018 
Target
Name:
Alpha-1,6-mannosyl-glycoprotein 2-beta-N-acetylglucosaminyltransferase
Synonyms:
2.4.1.143 GNT-II MGAT2 Mannoside acetylglucosaminyltransferase 2 Monoacylglycerol acyltransferase type 2 (h-MGAT2) h-MGAT2 (human monoacylglycerol acyltransferase type 2)
Type:
Mol. Mass.:
51567.80
Organism:
Homo sapiens (Human)
Description:
Q10469
Residue:
447
  
Inhibitor
Name:
BDBM272063
Synonyms:
US10065945, Example 57
Type:
Small organic molecule
Emp. Form.:
C24H25F2N5O4S
Mol. Mass.:
517.548
SMILES:
C[C@@H](N1CCc2ccc(cc2C1)S(=O)(=O)Nc1nc(no1)C(=O)N1CCCC1)c1cc(F)cc(F)c1
: