Target
Fibroblast growth factor receptor 1
Ligand
BDBM3078
Substrate
Poly(E:Y)
Meas. Tech.
Kinase Inhibition Assay
IC50
2400±n/a nM
Citation
 Klutchko, SRHamby, JMBoschelli, DHWu, ZKraker, AJAmar, AMHartl, BGShen, CKlohs, WDSteinkampf, RWDriscoll, DLNelson, JMElliott, WLRoberts, BJStoner, CLVincent, PWDykes, DJPanek, RLLu, GHMajor, TCDahring, TKHallak, HBradford, LAShowalter, HDDoherty, AM 2-Substituted aminopyrido[2,3-d]pyrimidin-7(8H)-ones. structure-activity relationships against selected tyrosine kinases and in vitro and in vivo anticancer activity. J Med Chem 41:3276-92 (1998)  
Target
Name:
Fibroblast growth factor receptor 1
Synonyms:
BFGFR Basic fibroblast growth factor receptor 1 (FGFR1) CEK FGFR-1 FGFR-1, (FL) FGFR1_HUMAN FLT2 Fibroblast growth factor receptor 1 (FGFR-1) Fms-like tyrosine kinase 2 N-sam bFGF-R | c-fgr
Type:
Receptor
Mol. Mass.:
91861.70
Organism:
Homo sapiens (Human)
Description:
P11362
Residue:
822
  
Inhibitor
Name:
BDBM3078
Synonyms:
2-[(3-bromophenyl)amino]-6-(2,6-dichlorophenyl)-8-methyl-7H,8H-pyrido[2,3-d]pyrimidin-7-one | 2-aminopyrido[2,3-d]pyrimidin-7(8H)-one 45
Type:
Small organic molecule
Emp. Form.:
C20H13BrCl2N4O
Mol. Mass.:
476.153
SMILES:
Cn1c2nc(Nc3cccc(Br)c3)ncc2cc(-c2c(Cl)cccc2Cl)c1=O
:
Substrate
Name:
Poly(E:Y)
Synonyms:
Type:
Random polymer
Mol. Mass.:
358.43
Organism:
Description:
Random copolymer of glutamic acid and tyrosine (4:1). 50 uM ATP containing 0.4 uCi of [gamma-32P]ATP as co-substrate
Residue:
3
NA