Target
Proto-oncogene tyrosine-protein kinase Src
Ligand
BDBM3080
Substrate
Poly(E:Y)
Meas. Tech.
Kinase Inhibition Assay
IC50
1200±n/a nM
Citation
 Klutchko, SRHamby, JMBoschelli, DHWu, ZKraker, AJAmar, AMHartl, BGShen, CKlohs, WDSteinkampf, RWDriscoll, DLNelson, JMElliott, WLRoberts, BJStoner, CLVincent, PWDykes, DJPanek, RLLu, GHMajor, TCDahring, TKHallak, HBradford, LAShowalter, HDDoherty, AM 2-Substituted aminopyrido[2,3-d]pyrimidin-7(8H)-ones. structure-activity relationships against selected tyrosine kinases and in vitro and in vivo anticancer activity. J Med Chem 41:3276-92 (1998)  
Target
Name:
Proto-oncogene tyrosine-protein kinase Src
Synonyms:
Calmodulin/Proto-oncogene tyrosine-protein kinase Src Proto-oncogene c-Src SRC SRC_HUMAN V-src sarcoma (Schmidt-Ruppin A-2) viral oncogene homolog (avian) p60-Src | pp60c-src
Type:
Protein
Mol. Mass.:
59838.60
Organism:
Homo sapiens (Human)
Description:
P12931
Residue:
536
  
Inhibitor
Name:
BDBM3080
Synonyms:
2-aminopyrido[2,3-d]pyrimidin-7(8H)-one 47 PD 166285 analog
Type:
Small organic molecule
Emp. Form.:
C21H16Cl2N4O2
Mol. Mass.:
427.283
SMILES:
COc1ccccc1Nc1ncc2cc(-c3c(Cl)cccc3Cl)c(=O)n(C)c2n1
:
Substrate
Name:
Poly(E:Y)
Synonyms:
Type:
Random polymer
Mol. Mass.:
358.43
Organism:
Description:
Random copolymer of glutamic acid and tyrosine (4:1). 50 uM ATP containing 0.4 uCi of [gamma-32P]ATP as co-substrate
Residue:
3
NA