Target
5-hydroxytryptamine receptor 2A
Ligand
BDBM50024206
Substrate
Ki
404±n/a nM
Comments
PDSP_437
Citation
 Battaglia, GShannon, MBorgundvaag, BTiteler, M pH-dependent modulation of agonist interactions with [3H]-ketanserin-labelled S2 serotonin receptors. Life Sci 33:2011-6 (1983)  
Target
Name:
5-hydroxytryptamine receptor 2A
Synonyms:
5-HT-2A 5-HT2A 5-hydroxytryptamine receptor 2A (5HT2A) Htr2 Serotonin Receptor 2A
Type:
G Protein-Coupled Receptor (GPCR)
Mol. Mass.:
52852.05
Organism:
Rattus norvegicus (rat)
Description:
Rat cortex membranes 5-HT2A receptors.
Residue:
471
  
Inhibitor
Name:
BDBM50024206
Synonyms:
3-[2-(dimethylamino)ethyl]-1H-indol-5-ol 3-[2-(dimethylamino)ethyl]indol-5-ol 5-hydroxy-N,N-dimethyltryptamine Bufotenine DM5-HT N,N-dimethylserotonin
Type:
Small organic molecule
Emp. Form.:
C12H16N2O
Mol. Mass.:
204.2682
SMILES:
CN(C)CCc1c[nH]c2ccc(O)cc12
: