Target
D(2) dopamine receptor
Ligand
BDBM81874
Substrate
Ki
2900±n/a nM
Comments
PDSP_732
Citation
 Zahniser, NRDubocovich, ML Comparison of dopamine receptor sites labeled by [3H]-S-sulpiride and [3H]-spiperone in striatum. J Pharmacol Exp Ther 227:592-9 (1983) Target
Name:
D(2) dopamine receptor
Synonyms:
DOPAMINE D2 DOPAMINE D2 Short Dopamine D2 receptor Drd2
Type:
G Protein-Coupled Receptor (GPCR)
Mol. Mass.:
50931.60
Organism:
Rattus norvegicus (rat)
Description:
P61169
Residue:
444
  
Inhibitor
Name:
BDBM81874
Synonyms:
Dopamine+ (GTP+) NPA+ (GTP+)
Type:
Emp. Form.:
C10H15N5O14P3
Mol. Mass.:
522.173
SMILES:
Nc1nc2n(cnc2c(=O)[nH]1)[C@@H]1O[C@H](COP(O)(=O)OP(O)(=O)OP(O)([O-])=O)[C@@H](O)[C@H]1O
: