Target
D(2) dopamine receptor
Ligand
BDBM50035398
Substrate
Ki
>10000±n/a nM
Comments
PDSP_222
Citation
 Arneric, SPSullivan, JPBriggs, CADonnelly-Roberts, DAnderson, DJRaszkiewicz, JLHughes, MLCadman, EDAdams, PGarvey, DS (S)-3-methyl-5-(1-methyl-2-pyrrolidinyl) isoxazole (ABT 418): a novel cholinergic ligand with cognition-enhancing and anxiolytic activities: I. In vitro characterization. J Pharmacol Exp Ther 270:310-8 (1994) Target
Name:
D(2) dopamine receptor
Synonyms:
D(2) dopamine receptor DOPAMINE D2 Long DRD2 Dopamine D2 receptor Dopamine D2 receptor (D2R) Dopamine2-like | d2
Type:
Cell-surface receptors
Mol. Mass.:
50647.10
Organism:
Homo sapiens (Human)
Description:
P14416
Residue:
443
  
Inhibitor
Name:
BDBM50035398
Synonyms:
(S)-1-Methyl-2-(3-methyl-isoxazol-5-yl)-pyrrolidinium 3-Methyl-5-((S)-1-methyl-pyrrolidin-2-yl)-isoxazole CHEMBL274525
Type:
Small organic molecule
Emp. Form.:
C9H14N2O
Mol. Mass.:
166.2203
SMILES:
CN1CCC[C@H]1c1cc(C)no1
: