Target
Somatostatin receptor type 2
Ligand
BDBM82254
Substrate
Ki
1.6±n/a nM
Comments
PDSP_3338
Citation
 Rossowski, WJGu, ZFAkarca, USJensen, RTCoy, DH Characterization of somatostatin receptor subtypes controlling rat gastric acid and pancreatic amylase release. Peptides 15:1421-4 (1994)  
Target
Name:
Somatostatin receptor type 2
Synonyms:
SOMATOSTATIN SST2 SS2R Somatostatin receptor Somatostatin receptor type 2 | Sstr2
Type:
Enzyme Catalytic Domain
Mol. Mass.:
41212.21
Organism:
RAT
Description:
SOMATOSTATIN SST2 SSTR2 RAT::P30680
Residue:
369
  
Inhibitor
Name:
BDBM82254
Synonyms:
D-Nal-Cys-Tyr-D-Trp-Lys-Val-Cys-Thr-NH2 | DC-25-100
Type:
Small organic molecule
Emp. Form.:
C41H60N10O9S2
Mol. Mass.:
901.107
SMILES:
CC(C)[C@H](NC(=O)[C@H](CCCCN)NC(=O)[C@H](Cc1c[nH]c2ccccc12)NC(=O)[C@H](Cc1ccc(O)cc1)NC(=O)[C@@H](N)CS)C(=O)N[C@@H](CS)C(=O)N[C@@H]([C@@H](C)O)C(N)=O
: