Target
Somatostatin receptor type 4
Ligand
BDBM82254
Substrate
Ki
0.1±n/a nM
Comments
PDSP_3338
Citation
 Rossowski, WJGu, ZFAkarca, USJensen, RTCoy, DH Characterization of somatostatin receptor subtypes controlling rat gastric acid and pancreatic amylase release. Peptides 15:1421-4 (1994)  
Target
Name:
Somatostatin receptor type 4
Synonyms:
SOMATOSTATIN SST4 Somatostatin receptor Sstr4
Type:
Enzyme Catalytic Domain
Mol. Mass.:
42096.84
Organism:
RAT
Description:
SOMATOSTATIN SST4 SSTR4 RAT::P30937
Residue:
384
  
Inhibitor
Name:
BDBM82254
Synonyms:
D-Nal-Cys-Tyr-D-Trp-Lys-Val-Cys-Thr-NH2 | DC-25-100
Type:
Small organic molecule
Emp. Form.:
C41H60N10O9S2
Mol. Mass.:
901.107
SMILES:
CC(C)[C@H](NC(=O)[C@H](CCCCN)NC(=O)[C@H](Cc1c[nH]c2ccccc12)NC(=O)[C@H](Cc1ccc(O)cc1)NC(=O)[C@@H](N)CS)C(=O)N[C@@H](CS)C(=O)N[C@@H]([C@@H](C)O)C(N)=O
: