Target
Somatostatin receptor type 4
Ligand
BDBM82255
Substrate
Ki
6±n/a nM
Comments
PDSP_1295
Citation
 Rossowski, WJGu, ZFAkarca, USJensen, RTCoy, DH Characterization of somatostatin receptor subtypes controlling rat gastric acid and pancreatic amylase release. Peptides 15:1421-4 (1994)  
Target
Name:
Somatostatin receptor type 4
Synonyms:
SOMATOSTATIN SST4 Somatostatin receptor Sstr4
Type:
Enzyme Catalytic Domain
Mol. Mass.:
42096.84
Organism:
RAT
Description:
SOMATOSTATIN SST4 SSTR4 RAT::P30937
Residue:
384
  
Inhibitor
Name:
BDBM82255
Synonyms:
D-Phe-Cys-Tyr-D-Trp-Lys-Abu-Cys-Nal-NH | NC8-12
Type:
Emp. Form.:
C57H69N11O8S2
Mol. Mass.:
1100.357
SMILES:
NCCCCC1NC(=O)C(Cc2c[nH]c3ccccc23)NC(=O)C(Cc2ccc(O)cc2)NC(=O)C(CSSCC(NC(=O)C(CCCN)NC1=O)C(=O)NCc1cccc2ccccc12)NC(=O)C(N)Cc1ccccc1
: