Target
Kappa-type opioid receptor
Ligand
BDBM82507
Substrate
Ki
405±n/a nM
Comments
PDSP_1212
Citation
 Codd, EEShank, RPSchupsky, JJRaffa, RB Serotonin and norepinephrine uptake inhibiting activity of centrally acting analgesics: structural determinants and role in antinociception. J Pharmacol Exp Ther 274:1263-70 (1995) Target
Name:
Kappa-type opioid receptor
Synonyms:
KOR-1 OPIATE Kappa Opioid receptor Ror-d
Type:
G Protein-Coupled Receptor (GPCR)
Mol. Mass.:
42692.90
Organism:
Rattus norvegicus (rat)
Description:
P34975
Residue:
380
  
Inhibitor
Name:
BDBM82507
Synonyms:
(+/-)-Methadone METHADONE NSC_22266
Type:
Small organic molecule
Emp. Form.:
C21H27NO
Mol. Mass.:
309.4452
SMILES:
CCC(=O)C(CC(C)N(C)C)(c1ccccc1)c1ccccc1
: