Target
Neuropeptides B/W receptor type 1
Ligand
BDBM50247803
Substrate
Ki
93±n/a nM
Comments
PDSP_3352
Citation
 O'Dowd, BFScheideler, MANguyen, TCheng, RRasmussen, JSMarchese, AZastawny, RHeng, HHTsui, LCShi, X The cloning and chromosomal mapping of two novel human opioid-somatostatin-like receptor genes, GPR7 and GPR8, expressed in discrete areas of the brain. Genomics 28:84-91 (1995)  
Target
Name:
Neuropeptides B/W receptor type 1
Synonyms:
GPR7 NPBWR1 | neuropeptides B/W receptor 1
Type:
Enzyme Catalytic Domain
Mol. Mass.:
36111.82
Organism:
Homo sapiens (Human)
Description:
gi_119607128
Residue:
328
  
Inhibitor
Name:
BDBM50247803
Synonyms:
Beta-Funeltrexamine beta-funaltrexamine methyl 3-[4-cyclopropylmethyl-10,17-dihydroxy-12-oxa-4-azapentacyclo[9.6.1.01,13.05,17.07,18]octadeca-7(18),8,10-trien-14-ylcarbamoyl]-(E)-2-propenoate
Type:
Small organic molecule
Emp. Form.:
C25H30N2O6
Mol. Mass.:
454.5155
SMILES:
COC(=O)\C=C\C(=O)N[C@@H]1CC[C@@]2(O)[C@H]3Cc4ccc(O)c5O[C@@H]1[C@]2(CCN3CC1CC1)c45
: